Reaction Details
TargetCorticotropin-releasing factor receptor 1
LigandBDBM50342734
Substrate/Competitorn/a
Meas. Tech.ChEMBL_744265 (CHEMBL1772072)
Ki 4474±n/a nM
Citation Griffith, DAHargrove, DMMaurer, TSBlum, CADe Lombaert, SInthavongsay, JKKlade, LEMack, CMRose, CRSanders, MJCarpino, PA Discovery and evaluation of pyrazolo[1,5-a]pyrimidines as neuropeptide Y1 receptor antagonists. Bioorg Med Chem Lett21:2641-5 (2011) 
 
Corticotropin-releasing factor receptor 1
Name:Corticotropin-releasing factor receptor 1
Type:Enzyme
Mol. Mass.:50744.31
Organism:Homo sapiens (Human)
Description:P34998
Residue:444
BDBM50342734
NameBDBM50342734
Synonyms:CHEMBL1771267 | N-(2-Aminoethyl)-N-ethyl-9-mesityl-2-methyl-9H-pyrimido[4, 5-b]indol-4-amine
TypeSmall organic molecule
Emp. Form.C24H29N5
Mol. Mass.387.5206
SMILESCCN(CCN)c1nc(C)nc2n(-c3c(C)cc(C)cc3C)c3ccccc3c12