Reaction Details
TargetHistone deacetylase 3/Nuclear receptor corepressor 2 (HDAC3/NCoR2)
LigandBDBM50342753
Substrate/Competitorn/a
Meas. Tech.ChEMBL_744274 (CHEMBL1772081)
IC50 15000±n/a nM
Citation Tang, WLuo, TGreenberg, EFBradner, JESchreiber, SL Discovery of histone deacetylase 8 selective inhibitors. Bioorg Med Chem Lett21:2601-5 (2011) 
 
Histone deacetylase 3/Nuclear receptor corepressor 2 (HDAC3/NCoR2)
Name:Histone deacetylase 3/Nuclear receptor corepressor 2 (HDAC3/NCoR2)
Type:n/a
Mol. Mass.:n/a
Description:ASSAY_ID of ChEMBL is 2146499
Components:This complex has 2 components.
Component 1
Name:Histone deacetylase 3
Synonyms:HD3 HDAC3_HUMAN Human HDAC3 SMAP45
Type:Enzyme
Mol. Mass.:48829.55
Organism:Homo sapiens (Human)
Description:O15379
Residue:428
Component 2
Name:Nuclear receptor corepressor 2
Synonyms:CTG repeat protein 26 Histone deacetylase 2/Nuclear receptor corepressor 2 NCOR2 Nuclear receptor corepressor 2 SMAP270 Silencing mediator of retinoic acid and thyroid hormone receptor TRAC | Thyroid-, retinoic-acid-receptor-associated corepressor
Type:Enzyme
Mol. Mass.:274839.59
Organism:Homo sapiens (Human)
Description:Q9Y618
Residue:2514
BDBM50342753
NameBDBM50342753
Synonyms:3-(2-(3-(((S)-5,12-dioxo-2-phenyl-1-oxa-4-azacyclododec-8-en-4-yl)methyl)benzylidene)hydrazinecarbonyl)-N-hydroxybenzamide | CHEMBL1771487
TypeSmall organic molecule
Emp. Form.C32H32N4O6
Mol. Mass.568.6197
SMILESONC(=O)c1cccc(c1)C(=O)NN=Cc1cccc(CN2C[C@@H](OC(=O)CC\C=C\CCC2=O)c2ccccc2)c1