Reaction Details
TargetHistone deacetylase 8
LigandBDBM50342750
Substrate/Competitorn/a
Meas. Tech.ChEMBL_744276 (CHEMBL1772083)
IC50 290±n/a nM
Citation Tang, WLuo, TGreenberg, EFBradner, JESchreiber, SL Discovery of histone deacetylase 8 selective inhibitors. Bioorg Med Chem Lett21:2601-5 (2011) 
 
Histone deacetylase 8
Name:Histone deacetylase 8
Type:Enzyme
Mol. Mass.:41749.60
Organism:Homo sapiens (Human)
Description:Q9BY41
Residue:377
BDBM50342750
NameBDBM50342750
Synonyms:CHEMBL1771484 | N,8-dihydroxy-8-(2-(4-(prop-2-ynyloxy)benzylidene)hydrazinyl)octanamide
TypeSmall organic molecule
Emp. Form.C18H23N3O4
Mol. Mass.345.3929
SMILESONC(=O)CCCCCCC(=O)NN=Cc1ccc(OCC#C)cc1