Reaction Details
TargetAcetylcholinesterase
LigandBDBM50342765
Substrate/Competitorn/a
Meas. Tech.ChEMBL_744405 (CHEMBL1772359)
IC50 22±n/a nM
Citation Li, YPNing, FXYang, MBLi, YCNie, MHOu, TMTan, JHHuang, SLLi, DGu, LQHuang, ZS Syntheses and characterization of novel oxoisoaporphine derivatives as dual inhibitors for cholinesterases and amyloid beta aggregation. Eur J Med Chem46:1572-81 (2011) 
 
Acetylcholinesterase
Name:Acetylcholinesterase
Type:Enzyme
Mol. Mass.:71812.79
Organism:Electrophorus electricus (Electric eel)
Description:n/a
Residue:633
BDBM50342765
NameBDBM50342765
Synonyms:4-(3-(Piperidin-1-yl)propoxy)-7H-dibenzo[de,h]quinolin-7-one | CHEMBL1770206
TypeSmall organic molecule
Emp. Form.C24H24N2O2
Mol. Mass.372.4596
SMILESO=C1c2ccccc2-c2nccc3c(OCCCN4CCCCC4)ccc1c23