Reaction Details
TargetRibosyldihydronicotinamide dehydrogenase [quinone]
LigandBDBM50260394
Substrate/Competitorn/a
Meas. Tech.ChEMBL_744413 (CHEMBL1772367)
IC50 2.7±n/a nM
Citation Leclerc, VEttaoussi, MRami, MFarce, ABoutin, JADelagrange, PCaignard, DHRenard, PBerthelot, PYous, S Design and synthesis of naphthalenic derivatives as new ligands at the melatonin binding site MT3. Eur J Med Chem46:1622-9 (2011) 
 
Ribosyldihydronicotinamide dehydrogenase [quinone]
Name:Ribosyldihydronicotinamide dehydrogenase [quinone]
Type:Protein
Mol. Mass.:25917.25
Organism:Homo sapiens (Human)
Description:P16083
Residue:231
BDBM50260394
NameBDBM50260394
Synonyms:5-MCA-NAT CHEMBL504585 | methyl 3-(2-acetamidoethyl)-1H-indol-5-ylcarbamate
TypeSmall organic molecule
Emp. Form.C14H17N3O3
Mol. Mass.275.3031
SMILESCOC(=O)Nc1ccc2[nH]cc(CCNC(C)=O)c2c1