Reaction Details
TargetRibosyldihydronicotinamide dehydrogenase [quinone]
LigandBDBM9019
Substrate/Competitorn/a
Meas. Tech.ChEMBL_744409 (CHEMBL1772363)
IC50 65±n/a nM
Citation Leclerc, VEttaoussi, MRami, MFarce, ABoutin, JADelagrange, PCaignard, DHRenard, PBerthelot, PYous, S Design and synthesis of naphthalenic derivatives as new ligands at the melatonin binding site MT3. Eur J Med Chem46:1622-9 (2011) 
 
Ribosyldihydronicotinamide dehydrogenase [quinone]
Name:Ribosyldihydronicotinamide dehydrogenase [quinone]
Type:Protein
Mol. Mass.:25917.25
Organism:Homo sapiens (Human)
Description:P16083
Residue:231
BDBM9019
NameBDBM9019
Synonyms:CHEMBL45 N-[2-(5-methoxy-1H-indol-3-yl)ethyl]acetamide
TypeSmall organic molecule
Emp. Form.C13H16N2O2
Mol. Mass.232.2783
SMILESCOc1ccc2[nH]cc(CCNC(C)=O)c2c1