Reaction Details
TargetRibosyldihydronicotinamide dehydrogenase [quinone]
LigandBDBM50342769
Substrate/Competitorn/a
Meas. Tech.ChEMBL_744409 (CHEMBL1772363)
IC50 0.390000±n/a nM
Citation Leclerc, VEttaoussi, MRami, MFarce, ABoutin, JADelagrange, PCaignard, DHRenard, PBerthelot, PYous, S Design and synthesis of naphthalenic derivatives as new ligands at the melatonin binding site MT3. Eur J Med Chem46:1622-9 (2011) 
 
Ribosyldihydronicotinamide dehydrogenase [quinone]
Name:Ribosyldihydronicotinamide dehydrogenase [quinone]
Type:Protein
Mol. Mass.:25917.25
Organism:Homo sapiens (Human)
Description:P16083
Residue:231
BDBM50342769
NameBDBM50342769
Synonyms:CHEMBL1770214 | N-[2-(7-methoxycarbonylamino-naphth-1-yl)ethyl]acetamide
TypeSmall organic molecule
Emp. Form.C16H18N2O3
Mol. Mass.286.3257
SMILESCOC(=O)Nc1ccc2cccc(CCNC(C)=O)c2c1