Reaction Details
TargetRibosyldihydronicotinamide dehydrogenase [quinone]
LigandBDBM50342770
Substrate/Competitorn/a
Meas. Tech.ChEMBL_744409 (CHEMBL1772363)
IC50 18±n/a nM
Citation Leclerc, VEttaoussi, MRami, MFarce, ABoutin, JADelagrange, PCaignard, DHRenard, PBerthelot, PYous, S Design and synthesis of naphthalenic derivatives as new ligands at the melatonin binding site MT3. Eur J Med Chem46:1622-9 (2011) 
 
Ribosyldihydronicotinamide dehydrogenase [quinone]
Name:Ribosyldihydronicotinamide dehydrogenase [quinone]
Type:Protein
Mol. Mass.:25917.25
Organism:Homo sapiens (Human)
Description:P16083
Residue:231
BDBM50342770
NameBDBM50342770
Synonyms:CHEMBL456727 N-[2-(7-methylsulfanyl-naphth-1-yl)ethyl]acetamide
TypeSmall organic molecule
Emp. Form.C15H17NOS
Mol. Mass.259.367
SMILESCSc1ccc2cccc(CCNC(C)=O)c2c1