Reaction Details
TargetRibosyldihydronicotinamide dehydrogenase [quinone]
LigandBDBM50342773
Substrate/Competitorn/a
Meas. Tech.ChEMBL_744409 (CHEMBL1772363)
IC50 32±n/a nM
Citation Leclerc, VEttaoussi, MRami, MFarce, ABoutin, JADelagrange, PCaignard, DHRenard, PBerthelot, PYous, S Design and synthesis of naphthalenic derivatives as new ligands at the melatonin binding site MT3. Eur J Med Chem46:1622-9 (2011) 
 
Ribosyldihydronicotinamide dehydrogenase [quinone]
Name:Ribosyldihydronicotinamide dehydrogenase [quinone]
Type:Protein
Mol. Mass.:25917.25
Organism:Homo sapiens (Human)
Description:P16083
Residue:231
BDBM50342773
NameBDBM50342773
Synonyms:CHEMBL457763 N-[2-(7-sulfamoyl-naphth-1-yl)ethyl]acetamide
TypeSmall organic molecule
Emp. Form.C14H16N2O3S
Mol. Mass.292.353
SMILESCC(=O)NCCc1cccc2ccc(cc12)S(N)(=O)=O