Reaction Details
TargetSolute carrier family 5 member 4
LigandBDBM50342889
Substrate/Competitorn/a
Meas. Tech.ChEMBL_745217 (CHEMBL1772493)
IC50 1.07±n/a nM
Citation Mascitti, VMaurer, TSRobinson, RPBian, JBoustany-Kari, CMBrandt, TCollman, BMKalgutkar, ASKlenotic, MKLeininger, MTLowe, AMaguire, RJMasterson, VMMiao, ZMukaiyama, EPatel, JDPettersen, JCPréville, CSamas, BShe, LSobol, ZSteppan, CMStevens, BDThuma, BATugnait, MZeng, DZhu, T Discovery of a clinical candidate from the structurally unique dioxa-bicyclo[3.2.1]octane class of sodium-dependent glucose cotransporter 2 inhibitors. J Med Chem54:2952-60 (2011) 
 
Solute carrier family 5 member 4
Name:Solute carrier family 5 member 4
Type:PROTEIN
Mol. Mass.:72452.26
Organism:Homo sapiens (Human)
Description:ChEMBL_764617
Residue:659
BDBM50342889
NameBDBM50342889
Synonyms:(1S,2S,3S,4R,5S)-1-(Hydroxymethyl)-5-[3-(4-methoxybenzyl)-4-methylphenyl]-6,8-dioxa-bicyclo[3.2.1]octane-2,3,4-triol | CHEMBL1770244
TypeSmall organic molecule
Emp. Form.C22H26O7
Mol. Mass.402.4376
SMILESCOc1ccc(Cc2cc(ccc2C)[C@]23OC[C@](CO)(O2)[C@@H](O)[C@H](O)[C@H]3O)cc1