Reaction Details
TargetDual specificity tyrosine-phosphorylation-regulated kinase 1B
LigandBDBM50342900
Substrate/Competitorn/a
Meas. Tech.ChEMBL_744230 (CHEMBL1772037)
IC50 846±n/a nM
Citation Rosenthal, ASTanega, CShen, MMott, BTBougie, JMNguyen, DTMisteli, TAuld, DSMaloney, DJThomas, CJ Potent and selective small molecule inhibitors of specific isoforms of Cdc2-like kinases (Clk) and dual specificity tyrosine-phosphorylation-regulated kinases (Dyrk). Bioorg Med Chem Lett21:3152-8 (2011) 
 
Dual specificity tyrosine-phosphorylation-regulated kinase 1B
Name:Dual specificity tyrosine-phosphorylation-regulated kinase 1B
Type:Enzyme
Mol. Mass.:69222.24
Organism:Homo sapiens (Human)
Description:Q9Y463
Residue:629
BDBM50342900
NameBDBM50342900
Synonyms:6-(benzo[d][1,3]dioxol-5-yl)-N-((5-methylfuran-2-yl)methyl)quinazolin-4-amine | CHEMBL1473127
TypeSmall organic molecule
Emp. Form.C21H17N3O3
Mol. Mass.359.378
SMILESCc1ccc(CNc2ncnc3ccc(cc23)-c2ccc3OCOc3c2)o1