Reaction Details
TargetDual specificity tyrosine-phosphorylation-regulated kinase 1B
LigandBDBM50342907
Substrate/Competitorn/a
Meas. Tech.ChEMBL_744230 (CHEMBL1772037)
IC50 1781±n/a nM
Citation Rosenthal, ASTanega, CShen, MMott, BTBougie, JMNguyen, DTMisteli, TAuld, DSMaloney, DJThomas, CJ Potent and selective small molecule inhibitors of specific isoforms of Cdc2-like kinases (Clk) and dual specificity tyrosine-phosphorylation-regulated kinases (Dyrk). Bioorg Med Chem Lett21:3152-8 (2011) 
 
Dual specificity tyrosine-phosphorylation-regulated kinase 1B
Name:Dual specificity tyrosine-phosphorylation-regulated kinase 1B
Type:Enzyme
Mol. Mass.:69222.24
Organism:Homo sapiens (Human)
Description:Q9Y463
Residue:629
BDBM50342907
NameBDBM50342907
Synonyms:6-(benzo[d][1,3]dioxol-5-yl)-N-methyl-N-((3-methylthiophen-2-yl)methyl)quinazolin-4-amine | CHEMBL1318637
TypeSmall organic molecule
Emp. Form.C22H19N3O2S
Mol. Mass.389.47
SMILESCN(Cc1sccc1C)c1ncnc2ccc(cc12)-c1ccc2OCOc2c1