Reaction Details
TargetDual specificity protein kinase CLK4
LigandBDBM50342926
Substrate/Competitorn/a
Meas. Tech.ChEMBL_744201 (CHEMBL1771958)
IC50 12±n/a nM
Citation Rosenthal, ASTanega, CShen, MMott, BTBougie, JMNguyen, DTMisteli, TAuld, DSMaloney, DJThomas, CJ Potent and selective small molecule inhibitors of specific isoforms of Cdc2-like kinases (Clk) and dual specificity tyrosine-phosphorylation-regulated kinases (Dyrk). Bioorg Med Chem Lett21:3152-8 (2011) 
 
Dual specificity protein kinase CLK4
Name:Dual specificity protein kinase CLK4
Type:Serine/threonine-protein kinase
Mol. Mass.:57522.53
Organism:Homo sapiens (Human)
Description:gi_10190706
Residue:481
BDBM50342926
NameBDBM50342926
Synonyms:6-(benzo[d][1,3]dioxol-5-yl)-N-methyl-N-(thiophen-2-ylmethyl)quinazolin-4-amine | CHEMBL1591577
TypeSmall organic molecule
Emp. Form.C21H17N3O2S
Mol. Mass.375.444
SMILESCN(Cc1cccs1)c1ncnc2ccc(cc12)-c1ccc2OCOc2c1