Reaction Details
TargetDual specificity protein kinase CLK1
LigandBDBM50342927
Substrate/Competitorn/a
Meas. Tech.ChEMBL_744227 (CHEMBL1772034)
IC50 14±n/a nM
Citation Rosenthal, ASTanega, CShen, MMott, BTBougie, JMNguyen, DTMisteli, TAuld, DSMaloney, DJThomas, CJ Potent and selective small molecule inhibitors of specific isoforms of Cdc2-like kinases (Clk) and dual specificity tyrosine-phosphorylation-regulated kinases (Dyrk). Bioorg Med Chem Lett21:3152-8 (2011) 
 
Dual specificity protein kinase CLK1
Name:Dual specificity protein kinase CLK1
Type:Protein
Mol. Mass.:57322.21
Organism:Homo sapiens (Human)
Description:P49759
Residue:484
BDBM50342927
NameBDBM50342927
Synonyms:6-(benzo[d][1,3]dioxol-5-yl)-N-ethyl-N-(thiophen-2-ylmethyl)quinazolin-4-amine | CHEMBL1515144
TypeSmall organic molecule
Emp. Form.C22H19N3O2S
Mol. Mass.389.47
SMILESCCN(Cc1cccs1)c1ncnc2ccc(cc12)-c1ccc2OCOc2c1