Reaction Details
TargetDual specificity tyrosine-phosphorylation-regulated kinase 1A
LigandBDBM50342921
Substrate/Competitorn/a
Meas. Tech.ChEMBL_744200 (CHEMBL1771957)
IC50 70±n/a nM
Citation Rosenthal, ASTanega, CShen, MMott, BTBougie, JMNguyen, DTMisteli, TAuld, DSMaloney, DJThomas, CJ Potent and selective small molecule inhibitors of specific isoforms of Cdc2-like kinases (Clk) and dual specificity tyrosine-phosphorylation-regulated kinases (Dyrk). Bioorg Med Chem Lett21:3152-8 (2011) 
 
Dual specificity tyrosine-phosphorylation-regulated kinase 1A
Name:Dual specificity tyrosine-phosphorylation-regulated kinase 1A
Type:Enzyme
Mol. Mass.:85616.61
Organism:Homo sapiens (Human)
Description:Q13627
Residue:763
BDBM50342921
NameBDBM50342921
Synonyms:6-(benzo[d][1,3]dioxol-5-yl)-N-(thiazol-2-ylmethyl)quinazolin-4-amine | CHEMBL1705549
TypeSmall organic molecule
Emp. Form.C19H14N4O2S
Mol. Mass.362.405
SMILESC(Nc1ncnc2ccc(cc12)-c1ccc2OCOc2c1)c1nccs1