Reaction Details
TargetDisintegrin and metalloproteinase domain-containing protein 17
LigandBDBM50342955
Substrate/Competitorn/a
Meas. Tech.ChEMBL_744255 (CHEMBL1772062)
Ki 6±n/a nM
Citation Dai, CLi, DPopovici-Muller, JZhao, LGirijavallabhan, VMRosner, KELavey, BJRizvi, RShankar, BBWong, MKGuo, ZOrth, PStrickland, COSun, JNiu, XChen, SKozlowski, JALundell, DJPiwinski, JJShih, NYSiddiqui, MA 2-(2-Aminothiazol-4-yl)pyrrolidine-based tartrate diamides as potent, selective and orally bioavailable TACE inhibitors. Bioorg Med Chem Lett21:3172-6 (2011) 
 
Disintegrin and metalloproteinase domain-containing protein 17
Name:Disintegrin and metalloproteinase domain-containing protein 17
Type:Enzyme
Mol. Mass.:93007.89
Organism:Homo sapiens (Human)
Description:
Residue:824
BDBM50342955
NameBDBM50342955
Synonyms:(2R,3R)-N-((R)-1-(4-(1H-pyrazol-1-yl)phenyl)ethyl)-4-((2R,4R)-2-(2-(ethylamino)thiazol-4-yl)-4-methylpyrrolidin-1-yl)-2,3-dihydroxy-4-oxobutanamide | CHEMBL1770821
TypeSmall organic molecule
Emp. Form.C25H32N6O4S
Mol. Mass.512.624
SMILESCCNc1nc(cs1)[C@H]1C[C@@H](C)CN1C(=O)[C@H](O)[C@@H](O)C(=O)N[C@H](C)c1ccc(cc1)-n1cccn1