Reaction Details
TargetMetabotropic glutamate receptor 1
LigandBDBM50333371
Substrate/Competitorn/a
Meas. Tech.ChEMBL_744512 (CHEMBL1772533)
Ki 4.8±n/a nM
Citation Yamasaki, TFujinaga, MYoshida, YKumata, KYui, JKawamura, KHatori, AFukumura, TZhang, MR Radiosynthesis and preliminary evaluation of 4-[18F]fluoro-N-[4-[6-(isopropylamino)pyrimidin-4-yl]-1,3-thiazol-2-yl]-N-methylbenzamide as a new positron emission tomography ligand for metabotropic glutamate receptor subtype 1. Bioorg Med Chem Lett21:2998-3001 (2011) 
 
Metabotropic glutamate receptor 1
Name:Metabotropic glutamate receptor 1
Type:Enzyme
Mol. Mass.:132358.19
Organism:Homo sapiens (Human)
Description:Q13255
Residue:1194
BDBM50333371
NameBDBM50333371
Synonyms:CHEMBL1645351 [11C]-6-N-cyclohexyl-6-(((2-methoxyethyl)(methyl)amino)methyl)-N-methylbenzo[d]thiazolo[3,2-a]imidazole-2-carboxamide
TypeSmall organic molecule
Emp. Form.C22H30N4O2S
Mol. Mass.414.564
SMILESCOCCN(C)Cc1ccc2nc3sc(cn3c2c1)C(=O)N(C)C1CCCCC1