Reaction Details
TargetMetabotropic glutamate receptor 1
LigandBDBM50273942
Substrate/Competitorn/a
Meas. Tech.ChEMBL_744512 (CHEMBL1772533)
Ki 2±n/a nM
Citation Yamasaki, TFujinaga, MYoshida, YKumata, KYui, JKawamura, KHatori, AFukumura, TZhang, MR Radiosynthesis and preliminary evaluation of 4-[18F]fluoro-N-[4-[6-(isopropylamino)pyrimidin-4-yl]-1,3-thiazol-2-yl]-N-methylbenzamide as a new positron emission tomography ligand for metabotropic glutamate receptor subtype 1. Bioorg Med Chem Lett21:2998-3001 (2011) 
 
Metabotropic glutamate receptor 1
Name:Metabotropic glutamate receptor 1
Type:Enzyme
Mol. Mass.:132358.19
Organism:Homo sapiens (Human)
Description:Q13255
Residue:1194
BDBM50273942
NameBDBM50273942
Synonyms:4-(1-(2-fluoropyridin-3-yl)-5-methyl-1H-1,2,3-triazol-4-yl)-N-isopropyl-N-methyl-5,6-dihydropyridine-1(2H)-carboxamide CHEMBL1645350 | CHEMBL502882
TypeSmall organic molecule
Emp. Form.C18H23FN6O
Mol. Mass.358.4132
SMILESCC(C)N(C)C(=O)N1CCC(=CC1)c1nnn(c1C)-c1cccnc1F