Reaction Details
TargetRibonuclease HI
LigandBDBM50269651
Substrate/Competitorn/a
Meas. Tech.ChEMBL_744865 (CHEMBL1772886)
IC50>20000±n/a nM
Citation Kim, JAYang, SYWamiru, AMcMahon, JBLe Grice, SFBeutler, JAKim, YH New monoterpene glycosides and phenolic compounds from Distylium racemosum and their inhibitory activity against ribonuclease H. Bioorg Med Chem Lett21:2840-4 (2011) 
 
Ribonuclease HI
Name:Ribonuclease HI
Type:Enzyme
Mol. Mass.:17601.33
Organism:Escherichia coli (strain K12)
Description:n/a
Residue:155
BDBM50269651
NameBDBM50269651
Synonyms:CHEMBL465208 | salidroside
TypeSmall organic molecule
Emp. Form.C14H20O7
Mol. Mass.300.3044
SMILESOC[C@H]1O[C@@H](OCCc2ccc(O)cc2)[C@H](O)[C@@H](O)[C@@H]1O