Reaction Details
TargetRibonuclease HI
LigandBDBM50343048
Substrate/Competitorn/a
Meas. Tech.ChEMBL_744865 (CHEMBL1772886)
IC50>20000±n/a nM
Citation Kim, JAYang, SYWamiru, AMcMahon, JBLe Grice, SFBeutler, JAKim, YH New monoterpene glycosides and phenolic compounds from Distylium racemosum and their inhibitory activity against ribonuclease H. Bioorg Med Chem Lett21:2840-4 (2011) 
 
Ribonuclease HI
Name:Ribonuclease HI
Type:Enzyme
Mol. Mass.:17601.33
Organism:Escherichia coli (strain K12)
Description:n/a
Residue:155
BDBM50343048
NameBDBM50343048
Synonyms:6''-O-galloylsalidroside | CHEMBL1770695
TypeSmall organic molecule
Emp. Form.C21H24O11
Mol. Mass.452.4087
SMILESO[C@H]1[C@H](O)[C@@H](COC(=O)c2cc(O)c(O)c(O)c2)O[C@@H](OCCc2ccc(O)cc2)[C@@H]1O