Reaction Details
TargetRibonuclease HI
LigandBDBM50241356
Substrate/Competitorn/a
Meas. Tech.ChEMBL_744865 (CHEMBL1772886)
IC50>20000±n/a nM
Citation Kim, JAYang, SYWamiru, AMcMahon, JBLe Grice, SFBeutler, JAKim, YH New monoterpene glycosides and phenolic compounds from Distylium racemosum and their inhibitory activity against ribonuclease H. Bioorg Med Chem Lett21:2840-4 (2011) 
 
Ribonuclease HI
Name:Ribonuclease HI
Type:Enzyme
Mol. Mass.:17601.33
Organism:Escherichia coli (strain K12)
Description:n/a
Residue:155
BDBM50241356
NameBDBM50241356
Synonyms:4-[(1E)-3-hydroxyprop-1-en-1-yl]-2,6-dimethoxyphenyl beta-D-glucopyranoside Eleutheroside B Lilacin Methoxyconiferine Syringenin Syringoside | beta-Terpineol
TypeSmall organic molecule
Emp. Form.C17H24O9
Mol. Mass.372.3671
SMILESCOc1cc(\C=C\CO)cc(OC)c1O[C@@H]1O[C@H](CO)[C@@H](O)[C@H](O)[C@H]1O