Reaction Details
TargetRibonuclease HI
LigandBDBM50343046
Substrate/Competitorn/a
Meas. Tech.ChEMBL_744865 (CHEMBL1772886)
IC50>20000±n/a nM
Citation Kim, JAYang, SYWamiru, AMcMahon, JBLe Grice, SFBeutler, JAKim, YH New monoterpene glycosides and phenolic compounds from Distylium racemosum and their inhibitory activity against ribonuclease H. Bioorg Med Chem Lett21:2840-4 (2011) 
 
Ribonuclease HI
Name:Ribonuclease HI
Type:Enzyme
Mol. Mass.:17601.33
Organism:Escherichia coli (strain K12)
Description:n/a
Residue:155
BDBM50343046
NameBDBM50343046
Synonyms:(4R)-p-menth-1-ene-7,8-diol-7-O-[beta-D-xylopyranosyl-(1->6)-beta-D-glucopyranosyl]ester | CHEMBL1770693
TypeSmall organic molecule
Emp. Form.C21H36O11
Mol. Mass.464.5039
SMILESCC(C)(O)[C@@H]1CCC(CO[C@H]2O[C@@H](CO[C@H]3OC[C@H](O)[C@@H](O)[C@@H]3O)[C@H](O)[C@@H](O)[C@@H]2O)=CC1