Reaction Details
TargetMatrix metalloproteinase-14
LigandBDBM11885
Substrate/Competitorn/a
Meas. Tech.ChEMBL_744874 (CHEMBL1772895)
IC50 8±n/a nM
Citation Fobian, YMFreskos, JNBarta, TEBedell, LJHeintz, RKassab, DJKiefer, JRMischke, BVMolyneaux, JMMullins, PMunie, GEBecker, DP MMP-13 selective alpha-sulfone hydroxamates: identification of selective P1' amides. Bioorg Med Chem Lett21:2823-5 (2011) 
 
Matrix metalloproteinase-14
Name:Matrix metalloproteinase-14
Type:Protein
Mol. Mass.:65900.19
Organism:Homo sapiens (Human)
Description:P50281
Residue:582
BDBM11885
NameBDBM11885
Synonyms:CHEMBL1082381 N-hydroxy-4-{[4-(phenylsulfanyl)benzene]sulfonyl}-1-(prop-2-yn-1-yl)piperidine-4-carboxamide hydrochloride alpha-sulfone 35f
TypeSmall organic molecule
Emp. Form.C21H22N2O4S2
Mol. Mass.430.54
SMILESONC(=O)C1(CCN(CC#C)CC1)S(=O)(=O)c1ccc(Sc2ccccc2)cc1