Reaction Details
TargetMatrix metalloproteinase-9
LigandBDBM50343063
Substrate/Competitorn/a
Meas. Tech.ChEMBL_744871 (CHEMBL1772892)
IC50 380±n/a nM
Citation Fobian, YMFreskos, JNBarta, TEBedell, LJHeintz, RKassab, DJKiefer, JRMischke, BVMolyneaux, JMMullins, PMunie, GEBecker, DP MMP-13 selective alpha-sulfone hydroxamates: identification of selective P1' amides. Bioorg Med Chem Lett21:2823-5 (2011) 
 
Matrix metalloproteinase-9
Name:Matrix metalloproteinase-9
Type:Enzyme
Mol. Mass.:78452.28
Organism:Homo sapiens (Human)
Description:P14780
Residue:707
BDBM50343063
NameBDBM50343063
Synonyms:CHEMBL1770697 | N-hydroxy-4-(4-(4-(methyl(4-(trifluoromethoxy)phenyl)amino)-4-oxobutoxy)phenylsulfonyl)tetrahydro-2H-pyran-4-carboxamide
TypeSmall organic molecule
Emp. Form.C24H27F3N2O8S
Mol. Mass.560.54
SMILESCN(C(=O)CCCOc1ccc(cc1)S(=O)(=O)C1(CCOCC1)C(=O)NO)c1ccc(OC(F)(F)F)cc1