Reaction Details
Target72 kDa type IV collagenase
LigandBDBM50343059
Substrate/Competitorn/a
Meas. Tech.ChEMBL_744869 (CHEMBL1772890)
IC50 18±n/a nM
Citation Fobian, YMFreskos, JNBarta, TEBedell, LJHeintz, RKassab, DJKiefer, JRMischke, BVMolyneaux, JMMullins, PMunie, GEBecker, DP MMP-13 selective alpha-sulfone hydroxamates: identification of selective P1' amides. Bioorg Med Chem Lett21:2823-5 (2011) 
 
72 kDa type IV collagenase
Name:72 kDa type IV collagenase
Type:Enzyme
Mol. Mass.:73870.36
Organism:Homo sapiens (Human)
Description: P08253
Residue:660
BDBM50343059
NameBDBM50343059
Synonyms:4-(4-(4-(4-(dimethylamino)phenyl)-4-oxobutoxy)phenylsulfonyl)-N-hydroxytetrahydro-2H-pyran-4-carboxamide | CHEMBL1770707
TypeSmall organic molecule
Emp. Form.C24H30N2O7S
Mol. Mass.490.569
SMILESCN(C)c1ccc(cc1)C(=O)CCCOc1ccc(cc1)S(=O)(=O)C1(CCOCC1)C(=O)NO