Reaction Details
TargetNeutrophil collagenase
LigandBDBM50343055
Substrate/Competitorn/a
Meas. Tech.ChEMBL_744870 (CHEMBL1772891)
IC50 700±n/a nM
Citation Fobian, YMFreskos, JNBarta, TEBedell, LJHeintz, RKassab, DJKiefer, JRMischke, BVMolyneaux, JMMullins, PMunie, GEBecker, DP MMP-13 selective alpha-sulfone hydroxamates: identification of selective P1' amides. Bioorg Med Chem Lett21:2823-5 (2011) 
 
Neutrophil collagenase
Name:Neutrophil collagenase
Type:Enzyme
Mol. Mass.:53413.48
Organism:Homo sapiens (Human)
Description:P22894
Residue:467
BDBM50343055
NameBDBM50343055
Synonyms:4-(4-(3-(2,4-dimethylbenzamido)propoxy)phenylsulfonyl)-N-hydroxytetrahydro-2H-pyran-4-carboxamide | CHEMBL1770703
TypeSmall organic molecule
Emp. Form.C24H30N2O7S
Mol. Mass.490.569
SMILESCc1ccc(C(=O)NCCCOc2ccc(cc2)S(=O)(=O)C2(CCOCC2)C(=O)NO)c(C)c1