Reaction Details
TargetNeutrophil collagenase
LigandBDBM50343061
Substrate/Competitorn/a
Meas. Tech.ChEMBL_744870 (CHEMBL1772891)
IC50 31±n/a nM
Citation Fobian, YMFreskos, JNBarta, TEBedell, LJHeintz, RKassab, DJKiefer, JRMischke, BVMolyneaux, JMMullins, PMunie, GEBecker, DP MMP-13 selective alpha-sulfone hydroxamates: identification of selective P1' amides. Bioorg Med Chem Lett21:2823-5 (2011) 
 
Neutrophil collagenase
Name:Neutrophil collagenase
Type:Enzyme
Mol. Mass.:53413.48
Organism:Homo sapiens (Human)
Description:P22894
Residue:467
BDBM50343061
NameBDBM50343061
Synonyms:CHEMBL1770157 | N-hydroxy-4-(4-(4-(4-methoxyphenylamino)-4-oxobutoxy)phenylsulfonyl)tetrahydro-2H-pyran-4-carboxamide
TypeSmall organic molecule
Emp. Form.C23H28N2O8S
Mol. Mass.492.542
SMILESCOc1ccc(NC(=O)CCCOc2ccc(cc2)S(=O)(=O)C2(CCOCC2)C(=O)NO)cc1