Reaction Details
TargetNeutrophil collagenase
LigandBDBM50343064
Substrate/Competitorn/a
Meas. Tech.ChEMBL_744870 (CHEMBL1772891)
IC50 800±n/a nM
Citation Fobian, YMFreskos, JNBarta, TEBedell, LJHeintz, RKassab, DJKiefer, JRMischke, BVMolyneaux, JMMullins, PMunie, GEBecker, DP MMP-13 selective alpha-sulfone hydroxamates: identification of selective P1' amides. Bioorg Med Chem Lett21:2823-5 (2011) 
 
Neutrophil collagenase
Name:Neutrophil collagenase
Type:Enzyme
Mol. Mass.:53413.48
Organism:Homo sapiens (Human)
Description:P22894
Residue:467
BDBM50343064
NameBDBM50343064
Synonyms:CHEMBL1770710 | N-hydroxy-4-(4-(4-oxo-4-(piperidin-1-yl)butoxy)phenylsulfonyl)tetrahydro-2H-pyran-4-carboxamide
TypeSmall organic molecule
Emp. Form.C21H30N2O7S
Mol. Mass.454.537
SMILESONC(=O)C1(CCOCC1)S(=O)(=O)c1ccc(OCCCC(=O)N2CCCCC2)cc1