Reaction Details
TargetCollagenase 3
LigandBDBM50343050
Substrate/Competitorn/a
Meas. Tech.ChEMBL_744872 (CHEMBL1772893)
IC50 8±n/a nM
Citation Fobian, YMFreskos, JNBarta, TEBedell, LJHeintz, RKassab, DJKiefer, JRMischke, BVMolyneaux, JMMullins, PMunie, GEBecker, DP MMP-13 selective alpha-sulfone hydroxamates: identification of selective P1' amides. Bioorg Med Chem Lett21:2823-5 (2011) 
 
Collagenase 3
Name:Collagenase 3
Type:Enzyme
Mol. Mass.:53808.06
Organism:Homo sapiens (Human)
Description:P45452
Residue:471
BDBM50343050
NameBDBM50343050
Synonyms:4-(4-(4-(4-(dimethylamino)benzoyl)piperidin-1-yl)phenylsulfonyl)-N-hydroxytetrahydro-2H-pyran-4-carboxamide | CHEMBL1770698
TypeSmall organic molecule
Emp. Form.C26H33N3O6S
Mol. Mass.515.622
SMILESCN(C)c1ccc(cc1)C(=O)C1CCN(CC1)c1ccc(cc1)S(=O)(=O)C1(CCOCC1)C(=O)NO