Reaction Details
TargetCollagenase 3
LigandBDBM50343052
Substrate/Competitorn/a
Meas. Tech.ChEMBL_744872 (CHEMBL1772893)
IC50 1.6±n/a nM
Citation Fobian, YMFreskos, JNBarta, TEBedell, LJHeintz, RKassab, DJKiefer, JRMischke, BVMolyneaux, JMMullins, PMunie, GEBecker, DP MMP-13 selective alpha-sulfone hydroxamates: identification of selective P1' amides. Bioorg Med Chem Lett21:2823-5 (2011) 
 
Collagenase 3
Name:Collagenase 3
Type:Enzyme
Mol. Mass.:53808.06
Organism:Homo sapiens (Human)
Description:P45452
Residue:471
BDBM50343052
NameBDBM50343052
Synonyms:CHEMBL1770700 | N-hydroxy-4-(4-(3-(4-methoxybenzamido)propoxy)phenylsulfonyl)tetrahydro-2H-pyran-4-carboxamide
TypeSmall organic molecule
Emp. Form.C23H28N2O8S
Mol. Mass.492.542
SMILESCOc1ccc(cc1)C(=O)NCCCOc1ccc(cc1)S(=O)(=O)C1(CCOCC1)C(=O)NO