Reaction Details
TargetMatrix metalloproteinase-14
LigandBDBM50343088
Substrate/Competitorn/a
Meas. Tech.ChEMBL_744956 (CHEMBL1771915)
Ki>10000±n/a nM
Citation Barta, TEBecker, DPBedell, LJEaston, AMHockerman, SLKiefer, JMunie, GEMathis, KJLi, MHRico, JGVillamil, CIWilliams, JM MMP-13 selectivea-sulfone hydroxamates: a survey of P1' heterocyclic amide isosteres. Bioorg Med Chem Lett21:2820-2 (2011) 
 
Matrix metalloproteinase-14
Name:Matrix metalloproteinase-14
Type:Protein
Mol. Mass.:65900.19
Organism:Homo sapiens (Human)
Description:P50281
Residue:582
BDBM50343088
NameBDBM50343088
Synonyms:CHEMBL1771223 | N-hydroxy-4-(4-(3-(1-(4-(trifluoromethoxy)phenyl)-1H-tetrazol-5-yl)propoxy)phenylsulfonyl)tetrahydro-2H-pyran-4-carboxamide
TypeSmall organic molecule
Emp. Form.C23H24F3N5O7S
Mol. Mass.571.526
SMILESONC(=O)C1(CCOCC1)S(=O)(=O)c1ccc(OCCCc2nnnn2-c2ccc(OC(F)(F)F)cc2)cc1