Reaction Details
TargetMatrix metalloproteinase-9
LigandBDBM50343086
Substrate/Competitorn/a
Meas. Tech.ChEMBL_744954 (CHEMBL1771913)
Ki 1800±n/a nM
Citation Barta, TEBecker, DPBedell, LJEaston, AMHockerman, SLKiefer, JMunie, GEMathis, KJLi, MHRico, JGVillamil, CIWilliams, JM MMP-13 selectivea-sulfone hydroxamates: a survey of P1' heterocyclic amide isosteres. Bioorg Med Chem Lett21:2820-2 (2011) 
 
Matrix metalloproteinase-9
Name:Matrix metalloproteinase-9
Type:Enzyme
Mol. Mass.:78452.28
Organism:Homo sapiens (Human)
Description:P14780
Residue:707
BDBM50343086
NameBDBM50343086
Synonyms:CHEMBL1771221 | N-hydroxy-4-(4-(3-(4-(4-(trifluoromethoxy)phenyl)-1H-imidazol-1-yl)propoxy)phenylsulfonyl)tetrahydro-2H-pyran-4-carboxamide
TypeSmall organic molecule
Emp. Form.C25H26F3N3O7S
Mol. Mass.569.55
SMILESONC(=O)C1(CCOCC1)S(=O)(=O)c1ccc(OCCCn2cnc(c2)-c2ccc(OC(F)(F)F)cc2)cc1