Reaction Details
TargetMatrix metalloproteinase-14
LigandBDBM50343077
Substrate/Competitorn/a
Meas. Tech.ChEMBL_744956 (CHEMBL1771915)
Ki 14±n/a nM
Citation Barta, TEBecker, DPBedell, LJEaston, AMHockerman, SLKiefer, JMunie, GEMathis, KJLi, MHRico, JGVillamil, CIWilliams, JM MMP-13 selectivea-sulfone hydroxamates: a survey of P1' heterocyclic amide isosteres. Bioorg Med Chem Lett21:2820-2 (2011) 
 
Matrix metalloproteinase-14
Name:Matrix metalloproteinase-14
Type:Protein
Mol. Mass.:65900.19
Organism:Homo sapiens (Human)
Description:P50281
Residue:582
BDBM50343077
NameBDBM50343077
Synonyms:CHEMBL1771212 | N-hydroxy-1-(2-methoxyethyl)-4-(4-(4-(trifluoromethoxy)phenoxy)phenylsulfonyl)piperidine-4-carboxamide
TypeSmall organic molecule
Emp. Form.C22H25F3N2O7S
Mol. Mass.518.503
SMILESCOCCN1CCC(CC1)(C(=O)NO)S(=O)(=O)c1ccc(Oc2ccc(OC(F)(F)F)cc2)cc1