Reaction Details
TargetMatrix metalloproteinase-14
LigandBDBM50343052
Substrate/Competitorn/a
Meas. Tech.ChEMBL_744956 (CHEMBL1771915)
Ki>10000±n/a nM
Citation Barta, TEBecker, DPBedell, LJEaston, AMHockerman, SLKiefer, JMunie, GEMathis, KJLi, MHRico, JGVillamil, CIWilliams, JM MMP-13 selectivea-sulfone hydroxamates: a survey of P1' heterocyclic amide isosteres. Bioorg Med Chem Lett21:2820-2 (2011) 
 
Matrix metalloproteinase-14
Name:Matrix metalloproteinase-14
Type:Protein
Mol. Mass.:65900.19
Organism:Homo sapiens (Human)
Description:P50281
Residue:582
BDBM50343052
NameBDBM50343052
Synonyms:CHEMBL1770700 | N-hydroxy-4-(4-(3-(4-methoxybenzamido)propoxy)phenylsulfonyl)tetrahydro-2H-pyran-4-carboxamide
TypeSmall organic molecule
Emp. Form.C23H28N2O8S
Mol. Mass.492.542
SMILESCOc1ccc(cc1)C(=O)NCCCOc1ccc(cc1)S(=O)(=O)C1(CCOCC1)C(=O)NO