Reaction Details
Target72 kDa type IV collagenase
LigandBDBM50343088
Substrate/Competitorn/a
Meas. Tech.ChEMBL_744950 (CHEMBL1771909)
Ki 430±n/a nM
Citation Barta, TEBecker, DPBedell, LJEaston, AMHockerman, SLKiefer, JMunie, GEMathis, KJLi, MHRico, JGVillamil, CIWilliams, JM MMP-13 selectivea-sulfone hydroxamates: a survey of P1' heterocyclic amide isosteres. Bioorg Med Chem Lett21:2820-2 (2011) 
 
72 kDa type IV collagenase
Name:72 kDa type IV collagenase
Type:Enzyme
Mol. Mass.:73870.36
Organism:Homo sapiens (Human)
Description: P08253
Residue:660
BDBM50343088
NameBDBM50343088
Synonyms:CHEMBL1771223 | N-hydroxy-4-(4-(3-(1-(4-(trifluoromethoxy)phenyl)-1H-tetrazol-5-yl)propoxy)phenylsulfonyl)tetrahydro-2H-pyran-4-carboxamide
TypeSmall organic molecule
Emp. Form.C23H24F3N5O7S
Mol. Mass.571.526
SMILESONC(=O)C1(CCOCC1)S(=O)(=O)c1ccc(OCCCc2nnnn2-c2ccc(OC(F)(F)F)cc2)cc1