Reaction Details
TargetNeutrophil collagenase
LigandBDBM50343081
Substrate/Competitorn/a
Meas. Tech.ChEMBL_744953 (CHEMBL1771912)
Ki 80±n/a nM
Citation Barta, TEBecker, DPBedell, LJEaston, AMHockerman, SLKiefer, JMunie, GEMathis, KJLi, MHRico, JGVillamil, CIWilliams, JM MMP-13 selectivea-sulfone hydroxamates: a survey of P1' heterocyclic amide isosteres. Bioorg Med Chem Lett21:2820-2 (2011) 
 
Neutrophil collagenase
Name:Neutrophil collagenase
Type:Enzyme
Mol. Mass.:53413.48
Organism:Homo sapiens (Human)
Description:P22894
Residue:467
BDBM50343081
NameBDBM50343081
Synonyms:CHEMBL1771216 | N-hydroxy-1-(2-methoxyethyl)-4-(4-(3-(5-(4-(trifluoromethoxy)phenyl)-2H-tetrazol-2-yl)propoxy)phenylsulfonyl)piperidine-4-carboxamide
TypeSmall organic molecule
Emp. Form.C26H31F3N6O7S
Mol. Mass.628.621
SMILESCOCCN1CCC(CC1)(C(=O)NO)S(=O)(=O)c1ccc(OCCCn2nnc(n2)-c2ccc(OC(F)(F)F)cc2)cc1