Reaction Details
TargetP2Y purinoceptor 14
LigandBDBM50343093
Substrate/Competitorn/a
Meas. Tech.ChEMBL_745158 (CHEMBL1772337)
IC50 140±n/a nM
Citation Guay, DBeaulieu, CBelley, MCrane, SNDeLuca, JGareau, YHamel, MHenault, MHyjazie, HKargman, SChan, CCXu, LGordon, RLi, LMamane, YMorin, NMancini, JThérien, MTranmer, GTruong, VLWang, ZBlack, WC Synthesis and SAR of pyrimidine-based, non-nucleotide P2Y14 receptor antagonists. Bioorg Med Chem Lett21:2832-5 (2011) 
 
P2Y purinoceptor 14
Name:P2Y purinoceptor 14
Type:PROTEIN
Mol. Mass.:38883.93
Organism:Mus musculus
Description:ChEMBL_745158
Residue:338
BDBM50343093
NameBDBM50343093
Synonyms:2-(3-cyanophenyl)-N-(3-ethylphenyl)-4-o-tolyl-7,8-dihydropyrido[4,3-d]pyrimidine-6(5H)-carboxamide | CHEMBL1771450
TypeSmall organic molecule
Emp. Form.C30H27N5O
Mol. Mass.473.5683
SMILESCCc1cccc(NC(=O)N2CCc3nc(nc(c3C2)-c2ccccc2C)-c2cccc(c2)C#N)c1