Reaction Details
TargetP2Y purinoceptor 14
LigandBDBM50343125
Substrate/Competitorn/a
Meas. Tech.ChEMBL_745158 (CHEMBL1772337)
IC50 30±n/a nM
Citation Guay, DBeaulieu, CBelley, MCrane, SNDeLuca, JGareau, YHamel, MHenault, MHyjazie, HKargman, SChan, CCXu, LGordon, RLi, LMamane, YMorin, NMancini, JThérien, MTranmer, GTruong, VLWang, ZBlack, WC Synthesis and SAR of pyrimidine-based, non-nucleotide P2Y14 receptor antagonists. Bioorg Med Chem Lett21:2832-5 (2011) 
 
P2Y purinoceptor 14
Name:P2Y purinoceptor 14
Type:PROTEIN
Mol. Mass.:38883.93
Organism:Mus musculus
Description:ChEMBL_745158
Residue:338
BDBM50343125
NameBDBM50343125
Synonyms:CHEMBL1771453 | N-(3-ethylphenyl)-2-(3-fluorophenyl)-4-o-tolyl-7,8-dihydropyrido[4,3-d]pyrimidine-6(5H)-carboxamide
TypeSmall organic molecule
Emp. Form.C29H27FN4O
Mol. Mass.466.5493
SMILESCCc1cccc(NC(=O)N2CCc3nc(nc(c3C2)-c2ccccc2C)-c2cccc(F)c2)c1