Reaction Details
TargetP2Y purinoceptor 14
LigandBDBM50343126
Substrate/Competitorn/a
Meas. Tech.ChEMBL_745158 (CHEMBL1772337)
IC50 880±n/a nM
Citation Guay, DBeaulieu, CBelley, MCrane, SNDeLuca, JGareau, YHamel, MHenault, MHyjazie, HKargman, SChan, CCXu, LGordon, RLi, LMamane, YMorin, NMancini, JThérien, MTranmer, GTruong, VLWang, ZBlack, WC Synthesis and SAR of pyrimidine-based, non-nucleotide P2Y14 receptor antagonists. Bioorg Med Chem Lett21:2832-5 (2011) 
 
P2Y purinoceptor 14
Name:P2Y purinoceptor 14
Type:PROTEIN
Mol. Mass.:38883.93
Organism:Mus musculus
Description:ChEMBL_745158
Residue:338
BDBM50343126
NameBDBM50343126
Synonyms:CHEMBL1771454 | N-(3-ethylphenyl)-2-(naphthalen-2-yl)-4-o-tolyl-7,8-dihydropyrido[4,3-d]pyrimidine-6(5H)-carboxamide
TypeSmall organic molecule
Emp. Form.C33H30N4O
Mol. Mass.498.6175
SMILESCCc1cccc(NC(=O)N2CCc3nc(nc(c3C2)-c2ccccc2C)-c2ccc3ccccc3c2)c1