Reaction Details
TargetBeta-2 adrenergic receptor
LigandBDBM50343157
Substrate/Competitorn/a
Meas. Tech.ChEMBL_745279 (CHEMBL1775311)
EC50 13±n/a nM
Citation Jones, LHBaldock, HBunnage, MEBurrows, JClarke, NCoghlan, MEntwistle, DFairman, DFeeder, NFulton, CHilton, LJames, KJones, RMKenyon, ASMarshall, SNewman, SDOsborne, RPatel, SSelby, MDStuart, EFTrevethick, MAWright, KNPrice, DA Inhalation by design: dual pharmacology β-2 agonists/M3 antagonists for the treatment of COPD. Bioorg Med Chem Lett21:2759-63 (2011) 
 
Beta-2 adrenergic receptor
Name:Beta-2 adrenergic receptor
Type:n/a
Mol. Mass.:46461.69
Organism:Homo sapiens (Human)
Description:P07550
Residue:413
BDBM50343157
NameBDBM50343157
Synonyms:CHEMBL1773264 | N-(5-((R)-2-(4-(4-(3-((R)-3-(diisopropylamino)-1-phenylpropyl)-4-hydroxyphenyl)butoxy)phenethylamino)-1-hydroxyethyl)-2-hydroxyphenyl)methanesulfonamide
TypeSmall organic molecule
Emp. Form.C42H57N3O6S
Mol. Mass.731.983
SMILESCC(C)N(CC[C@H](c1ccccc1)c1cc(CCCCOc2ccc(CCNC[C@H](O)c3ccc(O)c(NS(C)(=O)=O)c3)cc2)ccc1O)C(C)C