Reaction Details
TargetMuscarinic acetylcholine receptor M3
LigandBDBM50343161
Substrate/Competitorn/a
Meas. Tech.ChEMBL_745281 (CHEMBL1775313)
Ki 0.305000±n/a nM
Citation Jones, LHBaldock, HBunnage, MEBurrows, JClarke, NCoghlan, MEntwistle, DFairman, DFeeder, NFulton, CHilton, LJames, KJones, RMKenyon, ASMarshall, SNewman, SDOsborne, RPatel, SSelby, MDStuart, EFTrevethick, MAWright, KNPrice, DA Inhalation by design: dual pharmacology β-2 agonists/M3 antagonists for the treatment of COPD. Bioorg Med Chem Lett21:2759-63 (2011) 
 
Muscarinic acetylcholine receptor M3
Name:Muscarinic acetylcholine receptor M3
Type:Enzyme
Mol. Mass.:66151.03
Organism:Homo sapiens (Human)
Description:P20309
Residue:590
BDBM50343161
NameBDBM50343161
Synonyms:5-((R)-2-(4-(4-(3-((R)-3-(diisopropylamino)-1-phenylpropyl)-4-hydroxyphenyl)butoxy)phenethylamino)-1-hydroxyethyl)-8-hydroxyquinolin-2(1H)-one | CHEMBL1773267
TypeSmall organic molecule
Emp. Form.C44H55N3O5
Mol. Mass.705.9246
SMILESCC(C)N(CC[C@H](c1ccccc1)c1cc(CCCCOc2ccc(CCNC[C@H](O)c3ccc(O)c4[nH]c(=O)ccc34)cc2)ccc1O)C(C)C