Reaction Details
TargetPhosphatidylinositol 4,5-bisphosphate 3-kinase catalytic subunit alpha isoform
LigandBDBM50343212
Substrate/Competitorn/a
Meas. Tech.ChEMBL_745548 (CHEMBL1775865)
Ki<1±n/a nM
Citation D'Angelo, NDKim, TSAndrews, KBooker, SKCaenepeel, SChen, KD'Amico, DFreeman, DJiang, JLiu, LMcCarter, JDSan Miguel, TMullady, ELSchrag, MSubramanian, RTang, JWahl, RCWang, LWhittington, DAWu, TXi, NXu, YYakowec, PYang, KZalameda, LPZhang, NHughes, PNorman, MH Discovery and optimization of a series of benzothiazole phosphoinositide 3-kinase (PI3K)/mammalian target of rapamycin (mTOR) dual inhibitors. J Med Chem54:1789-811 (2011) 
 
Phosphatidylinositol 4,5-bisphosphate 3-kinase catalytic subunit alpha isoform
Name:Phosphatidylinositol 4,5-bisphosphate 3-kinase catalytic subunit alpha isoform
Type:Enzyme Subunit
Mol. Mass.:124294.87
Organism:Homo sapiens (Human)
Description:P42336
Residue:1068
BDBM50343212
NameBDBM50343212
Synonyms:CHEMBL1773734 | N-(6-(6-Chloro-5-(4-tert-butylphenylsulfonamido)pyridin-3-yl)benzo[d]thiazol-2-yl)acetamide
TypeSmall organic molecule
Emp. Form.C24H23ClN4O3S2
Mol. Mass.515.047
SMILESCC(=O)Nc1nc2ccc(cc2s1)-c1cnc(Cl)c(NS(=O)(=O)c2ccc(cc2)C(C)(C)C)c1