Reaction Details
TargetRAC-alpha serine/threonine-protein kinase
LigandBDBM50343208
Substrate/Competitorn/a
Meas. Tech.ChEMBL_745561 (CHEMBL1775878)
IC50 4.9±n/a nM
Citation D'Angelo, NDKim, TSAndrews, KBooker, SKCaenepeel, SChen, KD'Amico, DFreeman, DJiang, JLiu, LMcCarter, JDSan Miguel, TMullady, ELSchrag, MSubramanian, RTang, JWahl, RCWang, LWhittington, DAWu, TXi, NXu, YYakowec, PYang, KZalameda, LPZhang, NHughes, PNorman, MH Discovery and optimization of a series of benzothiazole phosphoinositide 3-kinase (PI3K)/mammalian target of rapamycin (mTOR) dual inhibitors. J Med Chem54:1789-811 (2011) 
 
RAC-alpha serine/threonine-protein kinase
Name:RAC-alpha serine/threonine-protein kinase
Type:Enzyme
Mol. Mass.:55681.25
Organism:Homo sapiens (Human)
Description:P31749
Residue:480
BDBM50343208
NameBDBM50343208
Synonyms:CHEMBL1773730 | N-(6-(6-Chloro-5-(2-chlorophenylsulfonamido)pyridin-3-yl)benzo[d]thiazol-2-yl)acetamide
TypeSmall organic molecule
Emp. Form.C20H14Cl2N4O3S2
Mol. Mass.493.386
SMILESCC(=O)Nc1nc2ccc(cc2s1)-c1cnc(Cl)c(NS(=O)(=O)c2ccccc2Cl)c1