Reaction Details
TargetSerine/threonine-protein kinase mTOR
LigandBDBM50343238
Substrate/Competitorn/a
Meas. Tech.ChEMBL_745549 (CHEMBL1775866)
IC50>6000±n/a nM
Citation D'Angelo, NDKim, TSAndrews, KBooker, SKCaenepeel, SChen, KD'Amico, DFreeman, DJiang, JLiu, LMcCarter, JDSan Miguel, TMullady, ELSchrag, MSubramanian, RTang, JWahl, RCWang, LWhittington, DAWu, TXi, NXu, YYakowec, PYang, KZalameda, LPZhang, NHughes, PNorman, MH Discovery and optimization of a series of benzothiazole phosphoinositide 3-kinase (PI3K)/mammalian target of rapamycin (mTOR) dual inhibitors. J Med Chem54:1789-811 (2011) 
 
Serine/threonine-protein kinase mTOR
Name:Serine/threonine-protein kinase mTOR
Type:Rapamycin target protein
Mol. Mass.:288917.12
Organism:Homo sapiens (Human)
Description:P42345
Residue:2549
BDBM50343238
NameBDBM50343238
Synonyms:CHEMBL1773564 | N-(6-(2-(4-Methoxybenzyloxy)pyrimidin-4-yl)benzo[d]thiazol-2-yl)acetamide
TypeSmall organic molecule
Emp. Form.C21H18N4O3S
Mol. Mass.406.458
SMILESCOc1ccc(COc2nccc(n2)-c2ccc3nc(NC(C)=O)sc3c2)cc1