Reaction Details
TargetSerine/threonine-protein kinase mTOR
LigandBDBM50343197
Substrate/Competitorn/a
Meas. Tech.ChEMBL_745549 (CHEMBL1775866)
IC50 11±n/a nM
Citation D'Angelo, NDKim, TSAndrews, KBooker, SKCaenepeel, SChen, KD'Amico, DFreeman, DJiang, JLiu, LMcCarter, JDSan Miguel, TMullady, ELSchrag, MSubramanian, RTang, JWahl, RCWang, LWhittington, DAWu, TXi, NXu, YYakowec, PYang, KZalameda, LPZhang, NHughes, PNorman, MH Discovery and optimization of a series of benzothiazole phosphoinositide 3-kinase (PI3K)/mammalian target of rapamycin (mTOR) dual inhibitors. J Med Chem54:1789-811 (2011) 
 
Serine/threonine-protein kinase mTOR
Name:Serine/threonine-protein kinase mTOR
Type:Rapamycin target protein
Mol. Mass.:288917.12
Organism:Homo sapiens (Human)
Description:P42345
Residue:2549
BDBM50343197
NameBDBM50343197
Synonyms:CHEMBL1773599 | N-(6-(5-(4-Methoxyphenylsulfonamido)pyridin-3-yl)benzo-[d]thiazol-2-yl)acetamide
TypeSmall organic molecule
Emp. Form.C21H18N4O4S2
Mol. Mass.454.522
SMILESCOc1ccc(cc1)S(=O)(=O)Nc1cncc(c1)-c1ccc2nc(NC(C)=O)sc2c1