Reaction Details
TargetKappa-type opioid receptor
LigandBDBM50159165
Substrate/Competitorn/a
Meas. Tech.ChEMBL_745571 (CHEMBL1775888)
Ki 7.4±n/a nM
Citation Lozama, ACunningham, CWCaspers, MJDouglas, JTDersch, CMRothman, RBPrisinzano, TE Opioid receptor probes derived from cycloaddition of the hallucinogen natural product salvinorin A. J Nat Prod74:718-26 (2011) 
 
Kappa-type opioid receptor
Name:Kappa-type opioid receptor
Type:G Protein-Coupled Receptor (GPCR)
Mol. Mass.:42648.76
Organism:Homo sapiens (Human)
Description:P41145
Residue:380
BDBM50159165
NameBDBM50159165
Synonyms:(2S,4aR,6aR,7R,9S,10aS,10bR)-9-(acetyloxy)-2-(furan-3-yl)dodecahydro-6a,10b-dimethyl-4,10-dioxo-2H-naphtho-[2,1-c]pyran-7-carboxylic acid methyl ester (2S,4aR,6aR,7R,9S,10aS,10bR)-methyl 9-acetoxy-2-(furan-3-yl)-6a,10b-dimethyl-4,10-dioxo-dodecahydro-1H-benzo[f]isochromene-7-carboxylate 2S,4aR,6a(R,7R,9S,10aS,10bR)-9-(acetyloxy)-2-(furan-3-yl)dodecahydro-6a,10b-dimethyl-4,10-dioxo-2H-naphtho[2,1-c]pyran-7-carboxylic acid methyl ester Salvinorin A salvinorin-A
TypeSmall organic molecule
Emp. Form.C23H28O8
Mol. Mass.432.4636
SMILESCOC(=O)[C@@H]1C[C@H](OC(C)=O)C(=O)[C@H]2[C@@]1(C)CC[C@H]1C(=O)O[C@@H](C[C@]21C)c1ccoc1