Reaction Details
TargetSodium- and chloride-dependent GABA transporter 3
LigandBDBM24183
Substrate/Competitorn/a
Meas. Tech.ChEMBL_745626 (CHEMBL1775996)
IC50 8128±n/a nM
Citation Hack, SWörlein, BHöfner, GPabel, JWanner, KT Development of imidazole alkanoic acids as mGAT3 selective GABA uptake inhibitors. Eur J Med Chem46:1483-98 (2011) 
 
Sodium- and chloride-dependent GABA transporter 3
Name:Sodium- and chloride-dependent GABA transporter 3
Type:PROTEIN
Mol. Mass.:69962.73
Organism:Mus musculus
Description:ChEMBL_1460090
Residue:627
BDBM24183
NameBDBM24183
Synonyms:4-amino-n-[2,3-3H]butyric acid Aminalon GABA [3H]GABA | cid_119
TypeRadiolabeled ligand
Emp. Form.C4H9NO2
Mol. Mass.103.1198
SMILESNCCCC(O)=O