Reaction Details
Target5-hydroxytryptamine receptor 2A
LigandBDBM50343262
Substrate/Competitorn/a
Meas. Tech.ChEMBL_745648 (CHEMBL1776018)
Ki 2.9±n/a nM
Citation Johnson, DSChoi, CFay, LKFavor, DARepine, JTWhite, ADAkunne, HCFitzgerald, LNicholls, KSnyder, BJWhetzel, SZZhang, LSerpa, KA Discovery of PF-00217830: aryl piperazine napthyridinones as D2 partial agonists for schizophrenia and bipolar disorder. Bioorg Med Chem Lett21:2621-5 (2011) 
 
5-hydroxytryptamine receptor 2A
Name:5-hydroxytryptamine receptor 2A
Type:undefined
Mol. Mass.:52607.65
Organism:Homo sapiens (Human)
Description:P28223
Residue:471
BDBM50343262
NameBDBM50343262
Synonyms:7-(4-(4-(2,3-dichlorophenyl)piperazin-1-yl)butoxy)-1,6-naphthyridin-2(1H)-one | CHEMBL1774065
TypeSmall organic molecule
Emp. Form.C22H24Cl2N4O2
Mol. Mass.447.358
SMILESClc1cccc(N2CCN(CCCCOc3cc4[nH]c(=O)ccc4cn3)CC2)c1Cl