Reaction Details
Target5-hydroxytryptamine receptor 2A
LigandBDBM50343279
Substrate/Competitorn/a
Meas. Tech.ChEMBL_745648 (CHEMBL1776018)
Ki 1.9±n/a nM
Citation Johnson, DSChoi, CFay, LKFavor, DARepine, JTWhite, ADAkunne, HCFitzgerald, LNicholls, KSnyder, BJWhetzel, SZZhang, LSerpa, KA Discovery of PF-00217830: aryl piperazine napthyridinones as D2 partial agonists for schizophrenia and bipolar disorder. Bioorg Med Chem Lett21:2621-5 (2011) 
 
5-hydroxytryptamine receptor 2A
Name:5-hydroxytryptamine receptor 2A
Type:undefined
Mol. Mass.:52607.65
Organism:Homo sapiens (Human)
Description:P28223
Residue:471
BDBM50343279
NameBDBM50343279
Synonyms:7-(4-(4-(3-fluoronaphthalen-1-yl)piperazin-1-yl)butoxy)-3,4-dihydro-1,8-naphthyridin-2(1H)-one | CHEMBL1774082
TypeSmall organic molecule
Emp. Form.C26H29FN4O2
Mol. Mass.448.5325
SMILESFc1cc(N2CCN(CCCCOc3ccc4CCC(=O)Nc4n3)CC2)c2ccccc2c1