Reaction Details
TargetTyrosine-protein kinase ABL1
LigandBDBM50343420
Substrate/Competitorn/a
Meas. Tech.ChEMBL_745920 (CHEMBL1776290)
Ki 720±n/a nM
Citation Radi, MDreassi, EBrullo, CCrespan, ETintori, CBernardo, VValoti, MZamperini, CDaigl, HMusumeci, FCarraro, FNaldini, AFilippi, IMaga, GSchenone, SBotta, M Design, synthesis, biological activity, and ADME properties of pyrazolo[3,4-d]pyrimidines active in hypoxic human leukemia cells: a lead optimization study. J Med Chem54:2610-26 (2011) 
 
Tyrosine-protein kinase ABL1
Name:Tyrosine-protein kinase ABL1
Type:Enzyme
Mol. Mass.:122897.30
Organism:Homo sapiens (Human)
Description:P00519
Residue:1130
BDBM50343420
NameBDBM50343420
Synonyms:6-(Methylsulfonyl)-1-(2-phenylvinyl)-N-propyl-1H-pyrazolo[3,4-d]pyrimidin-4-amine | CHEMBL1775044
TypeSmall organic molecule
Emp. Form.C17H19N5O2S
Mol. Mass.357.43
SMILESCCCNc1nc(nc2n(\C=C/c3ccccc3)ncc12)S(C)(=O)=O